{"text_format":"1","workbook":"xlsx","n_sheets":11,"sheets":["Veileder","Begrepsliste","Oppsummering","kun for IMDI","1 Lønn","2 Lønn med undervisningstid","3 Godtgjørelser","4 Egenandel","5 Fakturabaserte kostnader","6 Ansvarsgruppemøter","Innstillinger"],"not_rendered":{"charts":0,"images":8,"macros":1,"external_links":1,"defined_names":32,"comments":0,"pivot_tables":0},"unopened":[],"bounds":{"document_bytes":16777216,"sheet_cells":100000,"rows_first":2000,"rows_last":500,"rows_between":2000,"halvings":0,"cell_chars":16384,"cell_head_chars":4096},"cells_cut":0,"cells_raw":0,"read":"whole","date_system":"1900"}

{"sheet":"Veileder","index":0,"n_rows":75,"n_cols":8,"rows_kept":75,"cut":false,"hidden":false,"merged":[[5,3,5,4],[9,3,9,4],[11,3,11,4],[13,3,13,4],[17,3,18,4],[15,3,15,4],[73,2,73,3],[74,2,74,3],[31,7,31,8],[7,3,7,4],[72,2,72,3],[55,2,55,3],[66,2,66,3],[58,2,58,3],[68,2,68,3],[49,2,49,3],[40,2,40,3],[37,2,37,3]]}
[null,null,"Veileder"]
[]
[null,null,"Slik gjør dere:"]
[]
[]
[null,null,null,"1. Velg riktig skjema for hvert enkelt tiltak dere søker ekstratilskudd for"]
[]
[null,null,null,"2. Dersom lønnsutgiftene gjelder flere ansatte, kan dere enten registrere én beregning per person eller bruke gjennomsnittslønn"]
[]
[null,null,null,"3. Fyll ut feltene markert med grønt"]
[]
[null,null,null,"4. Dersom rød tekst vises i skjemaet, følg instruksjonene",null,null,null,"rød tekst"]
[]
[null,null,null,"5. Totalkostnaden vises nederst når alle obligatoriske felt er utfylt",null,null,null,100000]
[]
{"$rows_left_out":61}
{"sheet":"Begrepsliste","index":1,"n_rows":75,"n_cols":3,"rows_kept":75,"cut":false,"hidden":false,"merged":[]}
[null,null,"Begrepsliste"]
[]
[]
[null,null,"A"]
[null,null,"Antall ansatte"]
[null,null,"Antall ansatte, i denne sammenhengen, er antall ansatte i beregningen, som enkeltvis - eller samtidig - har direkte oppfølging med flyktningen i løpet av tilskuddsperioden."]
[]
[null,null,"Alminnelig arbeidstid"]
[null,null,"Alminnelig arbeidstid er den vanlige arbeidstiden personalet har i løpet av en uke eller dag, som fastsettes i arbeidsmiljøloven. Mange som har inngått en tariffavtale, har avtale om 37,5 timer per uke. For de som jobber skiftarbeid, turnusarbeid, nattarbeid og søndagsarbeid er den alminnelige ukentlige arbeidstiden kortere, som 35,5 timer per uke."]
[]
[null,null,"Arbeidsgiveravgift"]
[null,null,"Arbeidsgiveravgiften er regionalt differensiert og  fastsettes av Stortinget hvert år. Finn riktig arbeidsgiveravgift for din kommune her: "]
[null,null,"https://www.skatteetaten.no/satser/arbeidsgiveravgift-soneinndeling/"]
[]
[null,null,"Arbeidstimer per uke"]
{"$rows_left_out":61}
{"sheet":"Oppsummering","index":2,"n_rows":39,"n_cols":7,"rows_kept":39,"cut":false,"hidden":false,"merged":[[25,4,25,5],[26,4,26,5],[27,4,27,5],[28,4,28,5],[29,4,29,5]]}
[null,null,"Oppsummering"]
[]
[]
[null,null,"Totalsum for tiltakene beregnet i dette kostnadsverktøyet:",null,null,null,{"$f":"G6+G13+G20+G32+G25+G36","v":0}]
[]
[null,null,{"$f":"'1 Lønn'!C2","v":1},{"$f":"'1 Lønn'!E2","v":"Lønn "},null,null,{"$f":"SUM(G7:G11)","v":0}]
[null,null,null,1,{"$f":"IF(_xlfn.XLOOKUP(D7&\"a\",'1 Lønn'!P:P,'1 Lønn'!F:F,\"-\")=0,\"-\",_xlfn.XLOOKUP(D7&\"a\",'1 Lønn'!P:P,'1 Lønn'!F:F,\"-\"))","v":"-"},{"$f":"IF(_xlfn.XLOOKUP(D7&\"b\",'1 Lønn'!P:P,'1 Lønn'!F:F,\"-\")=0,\"-\",_xlfn.XLOOKUP(D7&\"b\",'1 Lønn'!P:P,'1 Lønn'!F:F,\"-\"))","v":"-"},{"$f":"_xlfn.XLOOKUP(D7&\"c\",'1 Lønn'!P:P,'1 Lønn'!F:F,\" \")","v":""}]
[null,null,null,2,{"$f":"IF(_xlfn.XLOOKUP(D8&\"a\",'1 Lønn'!P:P,'1 Lønn'!F:F,\"-\")=0,\"-\",_xlfn.XLOOKUP(D8&\"a\",'1 Lønn'!P:P,'1 Lønn'!F:F,\"-\"))","v":"-"},{"$f":"IF(_xlfn.XLOOKUP(D8&\"b\",'1 Lønn'!P:P,'1 Lønn'!F:F,\"-\")=0,\"-\",_xlfn.XLOOKUP(D8&\"b\",'1 Lønn'!P:P,'1 Lønn'!F:F,\"-\"))","v":"-"},{"$f":"_xlfn.XLOOKUP(D8&\"c\",'1 Lønn'!P:P,'1 Lønn'!F:F,\" \")","v":""}]
[null,null,null,3,{"$f":"IF(_xlfn.XLOOKUP(D9&\"a\",'1 Lønn'!P:P,'1 Lønn'!F:F,\"-\")=0,\"-\",_xlfn.XLOOKUP(D9&\"a\",'1 Lønn'!P:P,'1 Lønn'!F:F,\"-\"))","v":"-"},{"$f":"IF(_xlfn.XLOOKUP(D9&\"b\",'1 Lønn'!P:P,'1 Lønn'!F:F,\"-\")=0,\"-\",_xlfn.XLOOKUP(D9&\"b\",'1 Lønn'!P:P,'1 Lønn'!F:F,\"-\"))","v":"-"},{"$f":"_xlfn.XLOOKUP(D9&\"c\",'1 Lønn'!P:P,'1 Lønn'!F:F,\" \")","v":""}]
[null,null,null,4,{"$f":"IF(_xlfn.XLOOKUP(D10&\"a\",'1 Lønn'!P:P,'1 Lønn'!F:F,\"-\")=0,\"-\",_xlfn.XLOOKUP(D10&\"a\",'1 Lønn'!P:P,'1 Lønn'!F:F,\"-\"))","v":"-"},{"$f":"IF(_xlfn.XLOOKUP(D10&\"b\",'1 Lønn'!P:P,'1 Lønn'!F:F,\"-\")=0,\"-\",_xlfn.XLOOKUP(D10&\"b\",'1 Lønn'!P:P,'1 Lønn'!F:F,\"-\"))","v":"-"},{"$f":"_xlfn.XLOOKUP(D10&\"c\",'1 Lønn'!P:P,'1 Lønn'!F:F,\" \")","v":""}]
[null,null,null,5,{"$f":"IF(_xlfn.XLOOKUP(D11&\"a\",'1 Lønn'!P:P,'1 Lønn'!F:F,\"-\")=0,\"-\",_xlfn.XLOOKUP(D11&\"a\",'1 Lønn'!P:P,'1 Lønn'!F:F,\"-\"))","v":"-"},{"$f":"IF(_xlfn.XLOOKUP(D11&\"b\",'1 Lønn'!P:P,'1 Lønn'!F:F,\"-\")=0,\"-\",_xlfn.XLOOKUP(D11&\"b\",'1 Lønn'!P:P,'1 Lønn'!F:F,\"-\"))","v":"-"},{"$f":"_xlfn.XLOOKUP(D11&\"c\",'1 Lønn'!P:P,'1 Lønn'!F:F,\" \")","v":""}]
[]
[null,null,{"$f":"'2 Lønn med undervisningstid'!C2","v":2},{"$f":"'2 Lønn med undervisningstid'!E2","v":"Lønn med undervisningstid"},null,null,{"$f":"SUM(G14:G18)","v":0}]
[null,null,null,1,{"$f":"IF(_xlfn.XLOOKUP(D14&\"a\",'2 Lønn med undervisningstid'!P:P,'2 Lønn med undervisningstid'!F:F,\"-\")=0,\"-\",_xlfn.XLOOKUP(D14&\"a\",'2 Lønn med undervisningstid'!P:P,'2 Lønn med undervisningstid'!F:F,\"-\"))","v":"-"},{"$f":"IF(_xlfn.XLOOKUP(D14&\"b\",'2 Lønn med undervisningstid'!P:P,'2 Lønn med undervisningstid'!F:F,\"-\")=0,\"-\",_xlfn.XLOOKUP(D14&\"b\",'2 Lønn med undervisningstid'!P:P,'2 Lønn med undervisningstid'!F:F,\"-\"))","v":"-"},{"$f":"_xlfn.XLOOKUP(D14&\"c\",'2 Lønn med undervisningstid'!P:P,'2 Lønn med undervisningstid'!F:F,\" \")","v":""}]
[null,null,null,2,{"$f":"IF(_xlfn.XLOOKUP(D15&\"a\",'2 Lønn med undervisningstid'!P:P,'2 Lønn med undervisningstid'!F:F,\"-\")=0,\"-\",_xlfn.XLOOKUP(D15&\"a\",'2 Lønn med undervisningstid'!P:P,'2 Lønn med undervisningstid'!F:F,\"-\"))","v":"-"},{"$f":"IF(_xlfn.XLOOKUP(D15&\"b\",'2 Lønn med undervisningstid'!P:P,'2 Lønn med undervisningstid'!F:F,\"-\")=0,\"-\",_xlfn.XLOOKUP(D15&\"b\",'2 Lønn med undervisningstid'!P:P,'2 Lønn med undervisningstid'!F:F,\"-\"))","v":"-"},{"$f":"_xlfn.XLOOKUP(D15&\"c\",'2 Lønn med undervisningstid'!P:P,'2 Lønn med undervisningstid'!F:F,\" \")","v":""}]
{"$rows_left_out":25}
{"sheet":"kun for IMDI","index":3,"n_rows":27,"n_cols":14,"rows_kept":27,"cut":false,"hidden":true,"merged":[]}
[null,null,null,null,null,null,null,"------UTKAST------"]
[null,"Omregne årslønn fra årslønn med sos. utg. (metode #1)",null,null,null,null,null,"Omregne særskilt tilksudd til tilskuddsperiode"]
[null,"pension = % av årslønn (kommunes beregningen)",null,null,null,null,null,null,null,null,null,null,"barn","ungdom"]
[null,null,null,null,null,null,null,"Bosettingsdato","2024-04-04",null,null,"sats","0-16 år","17-20 år"]
[null,"Årslønn med sos. utg.",628866.53846153861,null,null,null,null,"Fødselsdato","2008-08-26",null,null,2023,1144400,721800]
[null,"sats feriepenger",0.12,null,"ferieuker =",{"$f":"IF(C6=12%,5,IF(C6=14.3%,6,0))","v":5},null,null,null,null,null,{"$f":"1+L5","v":2024},1194800,735500]
[null,"sats pensjon",0.09,null,null,null,null,null,null,"alder","sats",{"$f":"1+L6","v":2025},1059100,667900]
[null,"sats arbeidsgiveravgift",0.14099999999999999,null,null,null,null,{"$f":"YEAR(I4)","v":2024},{"$f":"M6/12*(12-MONTH(I4)+1)","v":896100},{"$f":"H8-YEAR($I$5)","v":16},{"$f":"IF(J8<17,$M$3,$N$3)","v":"barn"},{"$f":"1+L7","v":2026},1098700,692800]
[null,"Årslønn",{"$f":"C5/((1+C8)*((C6*(52-F6)/52)+C7+((52-F6)/52)))","v":500000.00000000017},null,null,null,null,{"$f":"1+H8","v":2025},{"$f":"N7","v":667900},{"$f":"H9-YEAR($I$5)","v":17},{"$f":"IF(J9<17,$M$3,$N$3)","v":"ungdom"}]
[null,null,null,null,null,null,null,{"$f":"1+H9","v":2026},{"$f":"N8","v":692800},18,"ungdom"]
[null,null,null,null,null,null,null,{"$f":"1+H10","v":2027},0,19,"ungdom"]
[null,null,null,null,null,null,null,{"$f":"1+H11","v":2028},{"$f":"N10","v":0},20,"ungdom"]
[null,"Omregne årslønn fra årslønn med sos. utg. (metode #2)"]
[null,"pension = % av lønn + fp (IMDIs beregningen)"]
[]
{"$rows_left_out":13}
{"sheet":"1 Lønn","index":4,"n_rows":366,"n_cols":24,"rows_kept":366,"cut":false,"hidden":false,"merged":[[215,4,220,6],[152,3,152,7],[153,4,153,7],[81,8,81,9],[82,8,82,9],[81,3,81,7],[82,4,82,7],[144,4,149,6],[73,4,78,6],[6,3,11,5],[6,8,11,10],[72,9,72,11],[73,9,78,11],[16,8,18,12],[294,3,294,7],[365,8,365,9],[143,9,143,11],[144,9,149,11],[214,9,214,11],[215,9,220,11],[285,9,285,11],[223,8,223,9],[224,8,224,9],[286,9,291,11],[152,8,152,9],[153,8,153,9],[286,4,291,6],[294,8,294,9],[223,3,223,7],[224,4,224,7],[366,8,366,9],[365,3,365,7],[366,4,366,7],[357,4,362,6],[295,4,295,7],[356,9,356,11],[357,9,362,11],[295,8,295,9]]}
[]
[null,null,1,null,"Lønn ",null,null,null,null,null,"(ver. 3.4)"]
[null,null,null,null,{"$f":"\"- til miljøterapeut, sykepleier, skoleassistent, kommunal tolk, eller andre kommunalt ansatte som ikke underviser\"","v":"- til miljøterapeut, sykepleier, skoleassistent, kommunal tolk, eller andre kommunalt ansatte som ikke underviser"}]
[]
[null,null,null,null,null,null,null,null,null,null,null,null,null,null,null,null,"Timesats max",650]
[null,null,null,null,"Dekkes av ekstratilskuddet:",null,null,null,"Dekkes ikke av ekstratilskuddet:",null,null,null,null,null,null,null,"Ansattes egenandel for pensjon",0,null,null,null,null,null,"Oppgitt årslønn er høyere enn det IMDi forventer i denne sammenhengen. Legg ved underbilag som dokumenterer den ansattes årslønn."]
[null,null,null,"þDirekte oppfølgingstid: Lønn for den tiden ansatte har direkte oppfølging med flyktningen, altså \"ansikt-til-ansikt\"\t\nþSosiale utgifter til: feriepenger, arbeidsgivers andel av pensjonskostnader og arbeidsgiveravgift",null,null,null,null,"xArbeidstid utenom direkte oppfølging: lønn til koordinering, reisetid og administrative oppgaver\nxSosiale utgifter til: overtid, vikarutgifter, merverdiavgifter, forsikring og administrative påslag\nxAnsattes egenandel for pensjon: ansattes egenandel for grunnpremie pensjon er som regel 2 %. Sett prosenten til 0 dersom den ansatte ikke trekkes for egenandel.",null,null,null,null,null,null,null,"Tekst 1","*obligatorisk ","bruk kun tall og komma, ikke bruk mellomrom og punktum",null,null,null,null,"Legg ved dokumentasjon som viser hvilke kostnader som er inkludert i pensjonskostnaden."]
[null,null,null,null,null,null,null,null,null,null,null,null,null,null,null,null,"Tekst 2","* valgfritt",null,null,null,null,null," Bekreft i kommentarfelt at dere ikke trekker den ansatte for egenandel."]
[null,null,null,null,null,null,null,null,null,null,null,null,null,null,null,null,"Tekst 3","⚠️Vi trenger mer informasjon. Se notat nederst."]
[null,null,null,null,null,null,null,null,null,null,null,null,null,null,null,null,"Tekst 4","Utregnes automatisk etter dere har fylt inn de obligatoriske feltene"]
[]
[]
[]
[]
[]
{"$rows_left_out":352}
{"sheet":"2 Lønn med undervisningstid","index":5,"n_rows":297,"n_cols":24,"rows_kept":297,"cut":false,"hidden":false,"merged":[[6,3,12,5],[6,8,12,10],[183,8,183,9],[228,9,228,10],[57,9,57,10],[68,8,68,9],[69,8,69,9],[182,8,182,9],[182,3,182,7],[58,4,65,6],[58,9,65,10],[172,9,179,10],[115,4,122,6],[115,9,122,10],[17,8,19,12],[297,8,297,9],[285,9,285,10],[286,4,293,6],[286,9,293,10],[296,8,296,9],[296,3,296,7],[297,4,297,7],[239,8,239,9],[240,8,240,9],[239,3,239,7],[240,4,240,7],[68,3,68,7],[69,4,69,7],[126,8,126,9],[171,9,171,10],[125,8,125,9],[125,3,125,7],[126,4,126,7],[114,9,114,10],[183,4,183,7],[229,4,236,6],[229,9,236,10],[172,4,179,6]]}
[]
[null,null,2,null,"Lønn med undervisningstid",null,null,null,null,null,{"$f":"'1 Lønn'!K2","v":"(ver. 3.4)"}]
[null,null,null,null,"-til lærer og -lektor, eller andre kommunalt ansatte som underviser i skolen"]
[]
[null,null,null,null,null,null,null,null,null,null,null,null,null,null,null,null,null,null,null,null,null,null,null,"Forklar i kommentarfeltet hvorfor dere søker om pedagogisk tiltak uten at PPT har tilrådet."]
[null,null,null,null,"Dekkes av ekstratilskuddet:",null,null,null,"Dekkes ikke av ekstratilskuddet:",null,null,null,null,null,null,null,"Timesats max",1550,null,null,null,null,null,"Forklar i kommentarfeltet hvorfor dere søker på flere timer enn PPT har tilrådet."]
[null,null,null,"þUndervisningstid: Lønn for den tiden den ansatte gir undervisning til flyktningen\nþFør- og etterarbeid til undervisningstimene: Dette er allerede innbakt i timelønnen. Satsen justeres automatisk etter valgene dere gjør i nedtrekksmenyen \"Årsramme\", og skal derfor ikke føres opp i eget punkt i beregningen.\nþSosiale utgifter til: feriepenger, arbeidsgivers andel av pensjonskostnader og arbeidsgiveravgift",null,null,null,null,"xArbeidstid utenom undervisning: Administrativt arbeid, eller \"egentid\", kompetanseheving, strategisk planlegging, andre oppgaver, eller \"fellestid\"\nxSosiale utgifter til: overtid, vikarutgifter, merverdiavgifter, forsikring og administrative påslag\nxAnsattes egenandel for pensjon: ansattes egenandel for grunnpremie pensjon er som regel 2 %. Sett prosenten til 0 dersom den ansatte ikke trekkes for egenandel.",null,null,null,null,null,null,null,"Ansattes egenandel for pensjon",0,null,null,null,null,null,"Oppgitt årslønn er høyere enn det IMDi forventer i denne sammenhengen. Legg ved underbilag som dokumenterer den ansattes årslønn."]
[null,null,null,null,null,null,null,null,null,null,null,null,null,null,null,null,"Tekst 1","*obligatorisk ","bruk kun tall og komma, ikke bruk mellomrom og punktum",null,null,null,null,"Legg ved dokumentasjon som viser hvilke kostnader som er inkludert i pensjonskostnaden."]
[null,null,null,null,null,null,null,null,null,null,null,null,null,null,null,null,"Tekst 2","* valgfritt",null,null,null,null,null," Bekreft i kommentarfelt at dere ikke trekker den ansatte for egenandel."]
[null,null,null,null,null,null,null,null,null,null,null,null,null,null,null,null,"Tekst 3","⚠️Vi trenger mer informasjon. Se notat nederst."]
[null,null,null,null,null,null,null,null,null,null,null,null,null,null,null,null,"Tekst 4","Utregnes automatisk etter dere har fylt inn de obligatoriske feltene"]
[]
[]
[null,null,null,null,null,null,null,null,null,"    "]
[]
{"$rows_left_out":283}
{"sheet":"3 Godtgjørelser","index":6,"n_rows":243,"n_cols":22,"rows_kept":243,"cut":false,"hidden":false,"merged":[[236,4,239,6],[242,3,242,7],[242,8,242,9],[243,4,243,7],[243,8,243,9],[205,4,208,6],[211,3,211,7],[211,8,211,9],[212,4,212,7],[212,8,212,9],[174,4,177,6],[180,3,180,7],[180,8,180,9],[181,4,181,7],[181,8,181,9],[150,8,150,9],[150,4,150,7],[149,8,149,9],[149,3,149,7],[143,4,146,6],[5,18,5,20],[39,4,43,6],[68,4,72,6],[6,3,9,5],[18,4,19,4],[6,8,9,12],[6,18,6,20],[118,8,118,9],[119,8,119,9],[112,4,115,6],[118,3,118,7],[119,4,119,7]]}
[]
[null,null,3,null,"Godtgjørelser",null,null,null,null,null,{"$f":"'1 Lønn'!K2","v":"(ver. 3.4)"}]
[null,null,null,null," - som omsorgsstønad, støttekontakt, avlastning og besøkshjem"]
[]
[]
[null,null,null,null,"Dekkes av ekstratilskuddet:",null,null,null,"Dekkes ikke av ekstratilskuddet:",null,null,null,null,null,null,null,"Pensjon max",0.1,{"$f":"'2 Lønn med undervisningstid'!X8","v":"Legg ved dokumentasjon som viser hvilke kostnader som er inkludert i pensjonskostnaden."}]
[null,null,null,"þLønn og stønad til privataktører som: leverer vedtaksbaserte tjenester etter helse- og omsorgstjenesteloven og barnevernloven\nþKS-satser: for fosterhjem og besøkshjem - reguleres årlig 01.juli. Mer info: ks.no\nþAGA: Arbeidsgiveravgift",null,null,null,null,"xMVA: Merverdiavgift \nxUtgiftsdekning til: mat, klær, fritid og boligkostnader\nxAnsattes egenandel for pensjon: ansattes egenandel for grunnpremie pensjon er som regel 2 %. Sett prosenten til 0 dersom den ansatte ikke trekkes for egenandel.",null,null,null,null,null,null,null,"Ansattes egenandel for pensjon",0,{"$f":"'2 Lønn med undervisningstid'!X9","v":" Bekreft i kommentarfelt at dere ikke trekker den ansatte for egenandel."}]
[null,null,null,null,null,null,null,null,null,null,null,null,null,null,null,null,"Text if blank","* Utskrivingdato kan ikke være en dato som kommer før innskrivingdato."]
[null,null,null,null,null,null,null,null,null,null,null,null,null,null,null,null,"Text if blank","*obligatorisk "]
[null,null,null,null,null,null,null,null,null,null,null,null,null,null,null,null,"Text if blank","* valgfritt"]
[]
[]
[]
[null,null,null,null,null,null,null,null,null,null,null,null,null,null,null,null,"Første måned i år",7]
[null,null,null,null,null,null,null,null,null,null,null,null,null,null,null,null,"Samme satsår?",{"$f":"_xlfn.IFS(OR(F21=\"\",F22=\"\"),\"\",T21=T22,\"JA\",TRUE,\"Nei\")","v":""}]
{"$rows_left_out":229}
{"sheet":"4 Egenandel","index":7,"n_rows":232,"n_cols":26,"rows_kept":232,"cut":false,"hidden":false,"merged":[[51,3,51,7],[6,3,7,5],[6,8,7,11],[19,4,19,5],[43,4,43,6],[44,4,48,6],[154,4,154,5],[52,4,52,7],[64,4,64,5],[88,4,88,6],[89,4,93,6],[96,3,96,7],[97,4,97,7],[109,4,109,5],[133,4,133,6],[134,4,138,6],[141,3,141,7],[142,4,142,7],[224,4,228,6],[231,3,231,7],[232,4,232,7],[178,4,178,6],[179,4,183,6],[186,3,186,7],[187,4,187,7],[199,4,199,5],[223,4,223,6]]}
[]
[null,null,4,null,"Egenandel",null,null,null,null,{"$f":"'1 Lønn'!K2","v":"(ver. 3.4)"}]
[null,null,null,null,{"$f":"\" - til statlige barnevernstiltak som barnevernsinstutisjoner, senter for foreldre og barn, beredskapshjem og spesialiserte fosterhjem, og MST / FFT\"","v":" - til statlige barnevernstiltak som barnevernsinstutisjoner, senter for foreldre og barn, beredskapshjem og spesialiserte fosterhjem, og MST / FFT"}]
[]
[null,null,null,null,null,null,null,null,null,null,null,null,null,null,null,null,null,null,null,null,null,"Velg fra liste…"]
[null,null,null,null,"Dekkes av ekstratilskuddet:",null,null,null,"Dekkes ikke av ekstratilskuddet:",null,null,null,null,null,null,"Text if blank","* Perioden kan ikke overstige ett år.",null,null,null,1,"opphold, én foresatt og ett barn (en sats)"]
[null,null,null,"þKommunal egenandel til: fosterhjemsplassering, institusjon og hjemmebaserte tiltak, inntil kommunens satser for egenbetaling for statlige barnevernstiltak.",null,null,null,null,"xUtgiftsdekning: til husleie, strøm, mat, utstyr, fritidsaktiviteter \nxLønn til: administrativt personale, undersøkelsessak og ordinær oppfølging av fosterhjem",null,null,null,null,null,null,"Text if blank","* Til dato kan ikke være en dato som kommer før fra dato.",null,null,null,1.5,"opphold, to foresatte og ett barn (en og en halv sats)"]
[null,null,null,null,null,null,null,null,null,null,null,null,null,null,null,"Text if blank","*obligatorisk ",null,null,null,0.5,"opphold, ett barn (halv sats)"]
[]
[]
[]
[]
[null,null,null,null,null,null,null,null,null,null,null,null,null,null,null,"Vis beregningen?",{"$f":"IF(I17&I21&I22&I18=\"\",\"ja\",\"nei\")","v":"nei"}]
[null,null,null,null,"Egenandel #1",null,null,null,null,null,null,null,null,null,null,"Felt","Verdi","Kommentar"]
[]
{"$rows_left_out":218}
{"sheet":"5 Fakturabaserte kostnader","index":8,"n_rows":70,"n_cols":11,"rows_kept":70,"cut":false,"hidden":false,"merged":[[53,4,53,5],[70,8,70,9],[69,8,69,9],[70,4,70,7],[69,3,69,7],[69,10,69,11],[30,4,30,10],[6,7,13,10],[6,4,13,6],[31,4,36,10],[59,4,64,10],[58,4,58,10],[45,4,45,5],[46,4,46,5],[47,4,47,5],[48,4,48,5],[54,4,54,5],[49,4,49,5],[50,4,50,5],[51,4,51,5],[52,4,52,5]]}
[]
[null,null,5,null,"Fakturabaserte kostnader",null,null,null,null,null,{"$f":"'1 Lønn'!K2","v":"(ver. 3.4)"}]
[null,null,null,null,{"$f":"\"- som lønn til privat psykolog og fysioterapeut, privat tolk og transport\"","v":"- som lønn til privat psykolog og fysioterapeut, privat tolk og transport"}]
[]
[]
[null,null,null,null,"Dekkes av ekstratilskuddet:",null,null,"Dekkes ikke av ekstratilskuddet:"]
[null,null,null,null,"þDirekte oppfølgingstid: Lønn for den tiden den ansatte har direkte oppfølging med flyktningen, altså \"ansikt-til-ansikt\"\nþTolkeutgifter: når tolken har blitt brukt i andre tiltak det søkes om ekstratilskudd til\nþTransport til og fra barnehage eller skole: som ikke dekkes av fylkeskommunen. I saker der flyktningen har vedtak om spesialundervisning, er hovedregelen at fylkeskommunen dekker kostnader til transport til og fra skole og barnehage.\nþKommunens egenandel til: transport til og fra barnehage eller skole, som fylkeskommunen dekker.",null,null,"xMVA: Merverdiavgift \t\t\t\nxArbeidstid uten direkte oppfølging: Administrative kostnader/ arbeidstid\nxTolk: reisetid for oppmøtetolk\nxTransportutgifter til og fra skole, eller barnehage: som dekkes av fylkeskommunen eller transportutgifter tilknyttet TT-kort.\nxTransport for kommunale tjenester: som hjemmetjeneste, barnevern og flyktningtjeneste."]
[]
[]
[]
[]
[]
[]
[]
[]
{"$rows_left_out":56}
{"sheet":"6 Ansvarsgruppemøter","index":9,"n_rows":339,"n_cols":25,"rows_kept":339,"cut":false,"hidden":false,"merged":[[6,3,11,11],[6,12,11,15],[36,4,36,5],[41,4,41,5],[37,13,37,14],[41,13,41,14],[36,13,36,14],[20,7,20,9],[21,7,21,9],[22,7,22,9],[28,7,28,9],[29,7,29,9],[37,7,37,9],[38,7,38,9],[38,4,38,5],[38,13,38,14],[58,13,58,15],[59,13,59,15],[58,3,58,11],[59,4,59,11],[12,7,12,11],[37,4,37,5],[48,15,54,15],[48,10,55,13],[48,4,55,7],[41,7,41,9],[47,10,47,13],[23,7,23,9],[24,7,24,9],[25,7,25,9],[26,7,26,9],[27,7,27,9],[39,4,39,5],[39,7,39,9],[39,13,39,14],[40,4,40,5],[40,7,40,9],[40,13,40,14]]}
[]
[null,null,6,null,"Ansvarsgruppemøter/ sakkyndig arbeid fra PPT",null,null,null,null,null,null,null,null,null,null,{"$f":"'1 Lønn'!K2","v":"(ver. 3.4)"}]
[null,null,null,null,{"$f":"\" - dokumenterte utgifter på inntil 30 000 kroner\"","v":" - dokumenterte utgifter på inntil 30 000 kroner"}]
[]
[]
[null,null,null,"Dekkes av ekstratilskuddet:",null,null,null,null,null,null,null,null,"Dekkes ikke av ekstratilskuddet:"]
[null,null,null,"þAnsvarsgruppemøter: Utgifter for antall møtedeltakere per gang og antall timer per møte. Beregn kun møter der flyktningen selv, eller en representant deltar.\t\t\t\nþSakkyndig arbeid fra: Dokumenterte utgifter fra Pedagogisk-psykologisk tjeneste (PPT)",null,null,null,null,null,null,null,null,"xSakkyndig utredning fra: andre instanser enn PPT\nxFør- og etterarbeid: av ansvarsgruppemøter\nxKoordinerende møter: uten at flyktningen selv, foreldre, eller verge  deltar\nxPensjonsutgifter til: arbeidstakers andel,  og reguleringspremie, eller andre størrelser etter aktuarberegninger og administrative påslag. Eksempler er premiefond, utjevning, selvrisiko, egenbetaling pensjon, eller fremtidig avsetning."]
[]
[]
[]
[]
[]
[]
[]
[]
{"$rows_left_out":325}
{"sheet":"Innstillinger","index":10,"n_rows":81,"n_cols":11,"rows_kept":81,"cut":false,"hidden":true,"merged":[]}
[]
[]
[]
[null,"INNSTILLINGER"]
[]
[]
[null,"Lønn"]
[null,"Velg fra liste….",null,null,"n/a"]
[null,"årslønn"]
[null,"timelønn"]
[]
[]
[null,"Område",null,null,"Utredning"]
[null,"Velg fra liste….",null,null,"Velg fra liste…."]
[null,"KS-området (utenom Oslo)",null,null,"Døgnopphold på senteret"]
{"$rows_left_out":66}